{"text_format":"1","workbook":"xlsx","n_sheets":11,"sheets":["Table of Contents","Introduction and User's Guide","Step 1 - General Info","Step 2 - Data Collection","Conversion Helper","Step 3 - Data Entry","Audit Data Summary","Stored Data","Sources","Background Calcs","Conversion Factors"],"not_rendered":{"charts":8,"images":0,"macros":1,"external_links":0,"defined_names":188,"comments":0,"pivot_tables":0},"unopened":[],"bounds":{"document_bytes":16777216,"sheet_cells":100000,"rows_first":2000,"rows_last":500,"rows_between":2000,"halvings":0,"cell_chars":16384,"cell_head_chars":4096},"cells_cut":0,"cells_raw":0,"read":"whole","date_system":"1900"}

{"sheet":"Table of Contents","index":0,"n_rows":17,"n_cols":3,"rows_kept":17,"cut":false,"hidden":false,"merged":[[15,1,15,2],[16,1,16,2],[14,1,14,2]]}
[]
[null,"EPA's Food and Packaging Waste Prevention Tool - Table of Contents"]
[]
[null,"Sheet Name","Purpose"]
[null,"Introduction and User's Guide","Provides introductory information about this tool and guides the user through the three main steps of collecting and entering food waste audit data."]
[null,"Step 1 - General Info","Contains several general questions about the facility to be answered by the user."]
{"$rows_left_out":12}
{"sheet":"Introduction and User's Guide","index":1,"n_rows":16,"n_cols":2,"rows_kept":16,"cut":false,"hidden":false,"merged":[]}
[null,"Welcome to EPA's Food and Packaging Waste Prevention Tool"]
[null,"Introduction"]
[]
[]
[]
[]
{"$rows_left_out":11}
{"sheet":"Step 1 - General Info","index":2,"n_rows":36,"n_cols":25,"rows_kept":36,"cut":false,"hidden":false,"merged":[[4,1,4,12],[22,1,22,12],[7,1,7,12],[8,1,10,12],[12,1,12,12],[29,1,29,7],[29,8,29,12],[15,1,15,12],[19,1,19,12],[31,1,31,12],[24,8,24,12],[24,1,24,7],[25,8,25,12],[25,1,25,7],[27,1,27,12],[17,1,17,8]]}
[]
[null,"Step 1: General Information about your facility"]
[null,"Please answer the following questions regarding the facility undergoing the food waste audit. "]
[]
[null,"What type of food service venue is your facility?",null,null,null,null,null,null,null,null,null,null,null,null,null,null,null,null,"Buffet",1]
[null,null,null,null,null,null,null,null,null,null,null,null,null,null,null,null,null,null,"Made-to-order"]
{"$rows_left_out":31}
{"sheet":"Step 2 - Data Collection","index":3,"n_rows":48,"n_cols":5,"rows_kept":48,"cut":false,"hidden":false,"merged":[[20,1,20,3],[10,1,10,4],[19,1,19,3],[40,1,40,3],[22,1,22,3],[42,1,42,3],[38,1,38,3],[2,1,5,3],[7,1,7,4],[18,1,18,3],[8,1,8,4],[11,1,11,4],[28,1,28,3],[29,1,29,3],[9,1,9,4],[41,1,41,3],[31,1,31,3],[21,1,21,3],[32,1,32,3],[39,1,39,3],[30,1,30,3]]}
[]
[null,"Step 2: Printable Data Collection Form"]
[null,"The Data Collection form below is designed to collect food waste information for three different types of food waste occuring in food venues; 1.) Kitchen Food Waste, 2.) Kitchen Packaging Waste, and 3.) Plate Waste.  Please print this form once a day and post for data collection at food venue. Please make sure that the print settings are set to single-sided printing. Data collection forms will be collected by appointed food waste manager and data will be entered on Data Entry tab weekly. Data should not be entered into this tab. THIS FORM SHOULD BE PRINTED FOR DATA COLLECTION PURPOSES ONLY; DATA SHOULD BE ENTERED ON THE DATA ENTRY TAB."]
[]
[]
[]
{"$rows_left_out":43}
{"sheet":"Conversion Helper","index":4,"n_rows":71,"n_cols":7,"rows_kept":71,"cut":false,"hidden":false,"merged":[[67,1,70,1],[42,1,47,1],[48,1,53,1],[54,1,59,1],[60,1,64,1],[26,1,29,1],[32,1,41,1],[2,1,2,6],[5,1,12,1],[13,1,17,1],[18,1,21,1],[22,1,25,1]]}
[]
[null,"Food and Packaging Waste Weight Conversion Helper"]
[null,"This sheet is designed to help convert food waste quantities listed on the paper data collection sheets to pounds that can be entered on the Data Entry sheet of this spreadsheet. Food waste managers should populate this sheet as the food waste audit progresses. \n\nSome default conversions have been provided (shaded pale blue) but the user can add as many additional conversion factors as needed. Click the \"Add Row\" in the respective food or packaging waste type to add conversion information. Then the user can modfy the number of units so that a total weight is calculated. For example, we have provided a default weight conversion for ground meat per cubic foot. The food waste manager could use this Conversion Helper to calculate the weight of, say, 5 cubic feet of ground meat by typing in the number 5 in the \"Number of Units\" column. "]
[]
[null,"Kitchen Food Waste"," Name","Unit","Weight per Unit (lbs)","Number of Units","Weight (lbs)"]
[null,"Protein",{"$f":"'Conversion Factors'!C5","v":"meat, ground"},{"$f":"'Conversion Factors'!D5","v":"cubic foot"},{"$f":"'Conversion Factors'!E5","v":52.5},1,{"$f":"E6*F6","v":52.5}]
{"$rows_left_out":66}
{"sheet":"Step 3 - Data Entry","index":5,"n_rows":168,"n_cols":43,"rows_kept":168,"cut":false,"hidden":false,"merged":[[163,22,163,23],[159,19,159,20],[163,4,163,5],[163,7,163,8],[163,10,163,11],[163,13,163,14],[163,16,163,17],[163,19,163,20],[160,22,160,23],[162,21,162,23],[162,3,162,5],[162,6,162,8],[162,9,162,11],[162,12,162,14],[162,15,162,17],[162,18,162,20],[159,7,159,8],[159,10,159,11],[159,13,159,14],[159,16,159,17],[160,4,160,5],[160,7,160,8],[160,10,160,11],[160,13,160,14],[142,1,149,1],[151,1,160,1],[143,3,143,5],[158,13,158,14],[159,4,159,5],[154,19,154,20],[155,22,155,23],[152,4,152,5],[152,7,152,8],[158,4,158,5],[158,7,158,8],[158,10,158,11],[152,10,152,11],[152,13,152,14],[154,7,154,8],[157,4,157,5],[160,19,160,20],[157,22,157,23],[157,7,157,8],[157,10,157,11],[157,13,157,14],[157,16,157,17],[156,19,156,20],[159,22,159,23],[129,19,129,20],[121,16,121,17],[101,22,101,23],[128,22,128,23],[127,4,127,5],[127,7,127,8],[126,7,126,8],[126,16,126,17],[125,19,125,20],[127,22,127,23],[128,4,128,5],[128,7,128,8],[128,10,128,11],[128,13,128,14],[128,16,128,17],[128,19,128,20],[127,10,127,11],[125,22,125,23],[126,10,126,11],[126,13,126,14],[126,4,126,5],[127,13,127,14],[127,16,127,17],[127,19,127,20],[129,22,129,23],[153,22,153,23],[131,18,131,20],[151,21,151,23],[90,13,90,14],[97,19,97,20],[97,22,97,23],[109,3,109,24],[121,19,121,20],[121,22,121,23],[101,4,101,5],[121,7,121,8],[121,10,121,11],[121,13,121,14],[101,16,101,17],[121,4,121,5],[101,19,101,20],[90,16,90,17],[97,10,97,11],[90,19,90,20],[97,16,97,17],[94,19,94,20],[95,10,95,11],[95,13,95,14],[90,22,90,23],[98,16,98,17],[98,19,98,20],[98,22,98,23],[97,4,97,5],[97,7,97,8],[95,22,95,23],[96,4,96,5],[96,7,96,8],[95,16,95,17],[160,16,160,17],[156,16,156,17],[158,22,158,23],[157,19,157,20],[158,16,158,17],[158,19,158,20],[156,10,156,11],[156,4,156,5],[156,7,156,8],[156,13,156,14],[156,22,156,23],[133,16,133,17],[153,7,153,8],[153,10,153,11],[153,13,153,14],[132,22,132,23],[153,19,153,20],[129,7,129,8],[129,10,129,11],[129,13,129,14],[131,12,131,14],[131,15,131,17],[142,9,142,11],[142,12,142,14],[142,15,142,17],[132,10,132,11],[139,1,139,24],[140,3,140,24],[132,4,132,5],[132,7,132,8],[129,16,129,17],[141,1,141,2],[131,21,131,23],[142,21,142,23],[136,13,136,14],[122,16,122,17],[122,19,122,20],[123,19,123,20],[126,19,126,20],[122,13,122,14],[126,22,126,23],[123,22,123,23],[123,16,123,17],[124,22,124,23],[112,12,112,14],[112,15,112,17],[112,21,112,23],[120,21,120,23],[120,12,120,14],[120,15,120,17],[120,18,120,20],[101,7,101,8],[101,10,101,11],[101,13,101,14],[102,22,102,23],[108,1,108,24],[102,10,102,11],[102,13,102,14],[102,16,102,17],[111,1,118,1],[104,16,104,17],[102,4,102,5],[102,7,102,8],[104,4,104,5],[102,19,102,20],[104,19,104,20],[105,22,105,23],[112,6,112,8],[124,7,124,8],[124,10,124,11],[124,13,124,14],[124,16,124,17],[124,19,124,20],[98,10,98,11],[98,13,98,14],[167,22,167,23],[91,4,91,5],[91,7,91,8],[91,10,91,11],[91,13,91,14],[91,16,91,17],[91,19,91,20],[91,22,91,23],[167,19,167,20],[164,22,164,23],[166,4,166,5],[166,7,166,8],[166,10,166,11],[166,13,166,14],[166,16,166,17],[167,4,167,5],[167,7,167,8],[167,10,167,11],[166,19,166,20],[166,22,166,23],[92,16,92,17],[92,19,92,20],[93,22,93,23],[94,22,94,23],[164,19,164,20],[100,9,100,11],[100,12,100,14],[92,13,92,14],[111,12,111,14],[123,10,123,11],[123,13,123,14],[96,10,96,11],[96,13,96,14],[96,16,96,17],[96,19,96,20],[96,22,96,23],[122,10,122,11],[111,18,111,20],[112,18,112,20],[153,16,153,17],[155,16,155,17],[40,19,40,20],[42,19,42,20],[34,19,34,20],[35,19,35,20],[34,4,34,5],[40,13,40,14],[42,13,42,14],[32,16,32,17],[32,10,32,11],[40,7,40,8],[34,7,34,8],[39,16,39,17],[39,19,39,20],[39,7,39,8],[42,7,42,8],[100,1,105,1],[27,1,36,1],[40,16,40,17],[42,16,42,17],[48,1,48,2],[47,1,47,2],[93,4,93,5],[93,7,93,8],[93,10,93,11],[50,15,50,17],[49,12,49,14],[49,15,49,17],[100,6,100,8],[97,13,97,14],[98,7,98,8],[43,16,43,17],[58,15,58,17],[70,13,70,14],[63,16,63,17],[59,16,59,17],[69,15,69,17],[164,4,164,5],[164,7,164,8],[93,13,93,14],[93,16,93,17],[93,19,93,20],[94,7,94,8],[94,10,94,11],[95,4,95,5],[95,7,95,8],[95,19,95,20],[142,18,142,20],[135,16,135,17],[135,19,135,20],[133,13,133,14],[132,19,132,20],[142,3,142,5],[142,6,142,8],[135,10,135,11],[135,13,135,14],[132,13,132,14],[132,16,132,17],[133,4,133,5],[133,7,133,8],[136,10,136,11],[162,1,167,1],[164,10,164,11],[164,13,164,14],[164,16,164,17],[80,9,80,11],[80,12,80,14],[80,15,80,17],[90,4,90,5],[167,16,167,17],[167,13,167,14],[131,1,136,1],[94,13,94,14],[94,16,94,17],[125,4,125,5],[125,7,125,8],[125,10,125,11],[125,13,125,14],[125,16,125,17],[155,4,155,5],[155,7,155,8],[155,10,155,11],[155,13,155,14],[143,6,143,8],[129,4,129,5],[71,19,71,20],[71,22,71,23],[67,4,67,5],[67,7,67,8],[73,4,73,5],[73,7,73,8],[73,10,73,11],[73,13,73,14],[60,22,60,23],[69,18,69,20],[69,21,69,23],[63,19,63,20],[70,19,70,20],[70,22,70,23],[60,13,60,14],[60,19,60,20],[63,10,63,11],[63,13,63,14],[61,22,61,23],[62,22,62,23],[43,19,43,20],[43,10,43,11],[43,13,43,14],[58,9,58,11],[58,12,58,14],[49,21,49,23],[50,9,50,11],[50,12,50,14],[49,18,49,20],[50,21,50,23],[58,21,58,23],[59,19,59,20],[59,22,59,23],[50,18,50,20],[58,18,58,20],[2,1,4,15],[6,1,6,5],[16,1,16,2],[7,1,7,5],[17,1,17,2],[27,12,27,14],[18,1,25,1],[27,6,27,8],[18,3,18,5],[19,3,19,5],[18,15,18,17],[19,6,19,8],[27,9,27,11],[18,6,18,8],[18,12,18,14],[9,1,10,15],[49,1,56,1],[58,1,67,1],[80,1,87,1],[89,1,98,1],[110,1,110,2],[70,10,70,11],[94,4,94,5],[98,4,98,5],[62,4,62,5],[92,4,92,5],[59,7,59,8],[65,4,65,5],[65,7,65,8],[65,10,65,11],[66,4,66,5],[66,7,66,8],[67,10,67,11],[79,1,79,2],[49,3,49,5],[49,6,49,8],[49,9,49,11],[90,7,90,8],[90,10,90,11],[60,10,60,11],[140,1,140,2],[120,1,129,1],[109,1,109,2],[100,3,100,5],[15,1,15,24],[16,3,16,24],[40,4,40,5],[42,4,42,5],[43,4,43,5],[39,22,39,23],[27,3,27,5],[27,15,27,17],[27,18,27,20],[27,21,27,23],[38,21,38,23],[34,22,34,23],[35,22,35,23],[31,16,31,17],[33,22,33,23],[36,22,36,23],[33,19,33,20],[35,16,35,17],[38,3,38,5],[28,22,28,23],[29,22,29,23],[30,22,30,23],[31,22,31,23],[32,22,32,23],[28,16,28,17],[29,16,29,17],[30,16,30,17],[32,19,32,20],[31,19,31,20],[18,21,18,23],[19,12,19,14],[19,15,19,17],[19,18,19,20],[19,21,19,23],[100,18,100,20],[100,21,100,23],[33,16,33,17],[36,16,36,17],[100,15,100,17],[18,18,18,20],[28,19,28,20],[29,19,29,20],[30,19,30,20],[66,22,66,23],[65,13,65,14],[65,16,65,17],[65,19,65,20],[67,13,67,14],[67,16,67,17],[67,19,67,20],[64,19,64,20],[64,22,64,23],[65,22,65,23],[30,7,30,8],[35,7,35,8],[32,7,32,8],[29,7,29,8],[59,10,59,11],[34,16,34,17],[36,4,36,5],[35,4,35,5],[39,10,39,11],[58,3,58,5],[58,6,58,8],[50,3,50,5],[50,6,50,8],[59,4,59,5],[32,4,32,5],[33,4,33,5],[60,16,60,17],[39,4,39,5],[111,21,111,23],[111,3,111,5],[111,6,111,8],[111,9,111,11],[31,13,31,14],[32,13,32,14],[33,13,33,14],[61,4,61,5],[63,22,63,23],[64,4,64,5],[64,7,64,8],[64,10,64,11],[70,4,70,5],[70,7,70,8],[69,3,69,5],[69,6,69,8],[69,9,69,11],[69,12,69,14],[66,19,66,20],[70,16,70,17],[152,22,152,23],[152,16,152,17],[136,19,136,20],[136,16,136,17],[136,22,136,23],[136,4,136,5],[143,9,143,11],[143,12,143,14],[143,15,143,17],[143,18,143,20],[143,21,143,23],[136,7,136,8],[28,7,28,8],[33,7,33,8],[31,7,31,8],[62,19,62,20],[38,15,38,17],[38,18,38,20],[38,9,38,11],[38,6,38,8],[34,10,34,11],[35,10,35,11],[38,12,38,14],[36,13,36,14],[36,7,36,8],[36,10,36,11],[43,7,43,8],[47,3,47,24],[40,10,40,11],[42,10,42,11],[40,22,40,23],[36,19,36,20],[28,4,28,5],[29,4,29,5],[30,4,30,5],[31,4,31,5],[30,13,30,14],[34,13,34,14],[35,13,35,14],[19,9,19,11],[28,13,28,14],[29,13,29,14],[33,10,33,11],[18,9,18,11],[39,13,39,14],[28,10,28,11],[29,10,29,11],[30,10,30,11],[31,10,31,11],[73,16,73,17],[74,4,74,5],[74,7,74,8],[74,10,74,11],[74,13,74,14],[73,19,73,20],[41,13,41,14],[41,16,41,17],[41,19,41,20],[61,7,61,8],[61,10,61,11],[61,13,61,14],[61,16,61,17],[61,19,61,20],[62,7,62,8],[62,10,62,11],[62,13,62,14],[62,16,62,17],[64,13,64,14],[72,10,72,11],[72,13,72,14],[72,16,72,17],[72,19,72,20],[64,16,64,17],[80,21,80,23],[92,10,92,11],[74,16,74,17],[81,9,81,11],[81,12,81,14],[92,22,92,23],[81,15,81,17],[78,3,78,24],[77,1,77,24],[78,1,78,2],[81,21,81,23],[89,3,89,5],[89,6,89,8],[89,9,89,11],[89,12,89,14],[89,15,89,17],[81,18,81,20],[89,18,89,20],[80,18,80,20],[80,3,80,5],[80,6,80,8],[81,3,81,5],[81,6,81,8],[69,1,74,1],[133,10,133,11],[105,4,105,5],[105,7,105,8],[105,10,105,11],[131,3,131,5],[131,6,131,8],[105,19,105,20],[122,7,122,8],[104,22,104,23],[133,19,133,20],[133,22,133,23],[131,9,131,11],[122,22,122,23],[124,4,124,5],[105,13,105,14],[105,16,105,17],[111,15,111,17],[123,4,123,5],[123,7,123,8],[104,7,104,8],[104,10,104,11],[104,13,104,14],[122,4,122,5],[112,3,112,5],[120,6,120,8],[120,9,120,11],[41,4,41,5],[41,7,41,8],[41,10,41,11],[92,7,92,8],[63,4,63,5],[63,7,63,8],[60,4,60,5],[60,7,60,8],[46,1,46,24],[38,1,43,1],[66,10,66,11],[66,13,66,14],[66,16,66,17],[67,22,67,23],[71,4,71,5],[71,7,71,8],[71,10,71,11],[41,22,41,23],[72,4,72,5],[72,7,72,8],[73,22,73,23],[89,21,89,23],[42,22,42,23],[59,13,59,14],[71,13,71,14],[71,16,71,17],[43,22,43,23],[134,4,134,5],[134,7,134,8],[134,10,134,11],[134,13,134,14],[134,16,134,17],[134,19,134,20],[134,22,134,23],[72,22,72,23],[103,4,103,5],[103,7,103,8],[103,10,103,11],[103,13,103,14],[103,16,103,17],[103,19,103,20],[103,22,103,23],[74,19,74,20],[74,22,74,23],[112,9,112,11],[120,3,120,5],[165,4,165,5],[165,7,165,8],[165,10,165,11],[165,13,165,14],[165,16,165,17],[165,19,165,20],[165,22,165,23],[135,22,135,23],[135,4,135,5],[135,7,135,8],[151,3,151,5],[151,6,151,8],[151,9,151,11],[151,12,151,14],[151,15,151,17],[151,18,151,20],[153,4,153,5],[155,19,155,20],[154,4,154,5],[154,10,154,11],[154,13,154,14],[154,16,154,17],[154,22,154,23],[152,19,152,20]]}
[]
[null,"Step 3: Data Entry "]
[null,"The Data Entry form should be filled once a week by the appointed food waste manager using information from the collected Data Collection sheet. As data is entered here, please convert to units of weight (in pounds) for each food waste or packaging type. If necessary, please use the Conversion Helper tab to help convert the individual food and packaging items listed on the data collection sheets into units of pounds.  \n\nOnce the data has been entered, please click on the \"Store Data\" button. A summary of the data entered throughout the audit will be displayed on a Data Summary tab. The \"Clear Data\" button will clear the data entry tab so that the next week's food and packaging waste data can be entered. "]
[]
[null,null,"Running total with graph showing total amounts"]
[]
{"$rows_left_out":163}
{"sheet":"Audit Data Summary","index":6,"n_rows":64,"n_cols":15,"rows_kept":64,"cut":false,"hidden":false,"merged":[[33,13,33,14],[34,13,34,14],[35,13,35,14],[32,11,32,12],[33,11,33,12],[34,11,34,12],[35,11,35,12],[36,11,36,12],[37,11,37,12],[60,9,60,10],[60,11,60,12],[60,13,60,14],[57,9,57,10],[57,11,57,12],[57,13,57,14],[36,13,36,14],[37,13,37,14],[38,13,38,14],[38,11,38,12],[56,11,56,12],[59,5,59,6],[59,7,59,8],[57,1,61,1],[57,3,57,4],[59,3,59,4],[60,3,60,4],[57,5,57,6],[57,7,57,8],[60,5,60,6],[60,7,60,8],[61,3,61,4],[61,5,61,6],[61,7,61,8],[58,3,58,4],[58,5,58,6],[58,7,58,8],[39,13,39,14],[40,13,40,14],[41,13,41,14],[42,13,42,14],[43,13,43,14],[44,9,44,10],[5,1,10,1],[12,1,20,1],[33,1,38,1],[32,3,32,4],[32,5,32,6],[36,3,36,4],[37,3,37,4],[38,3,38,4],[33,5,33,6],[33,3,33,4],[34,3,34,4],[35,3,35,4],[34,5,34,6],[35,5,35,6],[22,1,26,1],[36,5,36,6],[32,13,32,14],[33,9,33,10],[47,11,47,12],[48,11,48,12],[33,7,33,8],[34,7,34,8],[35,7,35,8],[36,7,36,8],[37,7,37,8],[38,7,38,8],[34,9,34,10],[36,9,36,10],[37,9,37,10],[38,9,38,10],[35,9,35,10],[39,11,39,12],[44,11,44,12],[44,13,44,14],[43,11,43,12],[40,11,40,12],[46,7,46,8],[46,9,46,10],[47,9,47,10],[48,9,48,10],[61,9,61,10],[61,11,61,12],[61,13,61,14],[59,11,59,12],[59,13,59,14],[59,9,59,10],[41,11,41,12],[42,11,42,12],[53,7,53,8],[54,7,54,8],[45,11,45,12],[45,13,45,14],[46,11,46,12],[46,13,46,14],[47,13,47,14],[48,13,48,14],[39,3,39,4],[39,5,39,6],[39,7,39,8],[39,9,39,10],[37,5,37,6],[38,5,38,6],[32,7,32,8],[32,9,32,10],[40,9,40,10],[51,5,51,6],[52,5,52,6],[53,5,53,6],[54,5,54,6],[43,3,43,4],[43,5,43,6],[43,7,43,8],[43,9,43,10],[44,3,44,4],[44,5,44,6],[44,7,44,8],[46,3,46,4],[46,5,46,6],[42,3,42,4],[42,5,42,6],[42,7,42,8],[42,9,42,10],[41,3,41,4],[41,5,41,6],[41,7,41,8],[41,9,41,10],[50,5,50,6],[47,1,55,1],[47,3,47,4],[48,3,48,4],[49,3,49,4],[50,3,50,4],[51,3,51,4],[52,3,52,4],[53,3,53,4],[54,3,54,4],[55,3,55,4],[55,13,55,14],[47,5,47,6],[48,5,48,6],[49,5,49,6],[58,9,58,10],[58,11,58,12],[58,13,58,14],[56,13,56,14],[40,1,45,1],[40,3,40,4],[40,5,40,6],[40,7,40,8],[49,9,49,10],[50,9,50,10],[51,9,51,10],[52,9,52,10],[54,9,54,10],[45,3,45,4],[45,5,45,6],[45,7,45,8],[45,9,45,10],[47,7,47,8],[48,7,48,8],[49,7,49,8],[56,3,56,4],[56,5,56,6],[56,7,56,8],[56,9,56,10],[49,13,49,14],[50,13,50,14],[54,11,54,12],[53,13,53,14],[54,13,54,14],[49,11,49,12],[50,11,50,12],[51,11,51,12],[52,11,52,12],[51,13,51,14],[52,13,52,14],[53,9,53,10],[53,11,53,12],[50,7,50,8],[51,7,51,8],[52,7,52,8],[55,5,55,6],[55,7,55,8],[55,9,55,10],[55,11,55,12]]}
[]
[null,"Audit Data Summary"]
[null,null,null,1,2,3,4,5,6,7,8,9,10,11,12]
[null,null,null,"Week 1","Week 2","Week 3","Week 4","Week 5","Week 6","Week 7","Week 8","Week 9","Week 10","Week 11","Week 12"]
[null,null,"Week Starting Date:",{"$f":"IF(VLOOKUP(D$3,'Background Calcs'!$A$22:$C$73,3,FALSE)=0,\"\",VLOOKUP(D$3,'Background Calcs'!$A$22:$C$73,3,FALSE))","v":""},{"$f":"IF(VLOOKUP(E$3,'Background Calcs'!$A$22:$C$73,3,FALSE)=0,\"\",VLOOKUP(E$3,'Background Calcs'!$A$22:$C$73,3,FALSE))","v":""},{"$f":"IF(VLOOKUP(F$3,'Background Calcs'!$A$22:$C$73,3,FALSE)=0,\"\",VLOOKUP(F$3,'Background Calcs'!$A$22:$C$73,3,FALSE))","v":""},{"$f":"IF(VLOOKUP(G$3,'Background Calcs'!$A$22:$C$73,3,FALSE)=0,\"\",VLOOKUP(G$3,'Background Calcs'!$A$22:$C$73,3,FALSE))","v":""},{"$f":"IF(VLOOKUP(H$3,'Background Calcs'!$A$22:$C$73,3,FALSE)=0,\"\",VLOOKUP(H$3,'Background Calcs'!$A$22:$C$73,3,FALSE))","v":""},{"$f":"IF(VLOOKUP(I$3,'Background Calcs'!$A$22:$C$73,3,FALSE)=0,\"\",VLOOKUP(I$3,'Background Calcs'!$A$22:$C$73,3,FALSE))","v":""},{"$f":"IF(VLOOKUP(J$3,'Background Calcs'!$A$22:$C$73,3,FALSE)=0,\"\",VLOOKUP(J$3,'Background Calcs'!$A$22:$C$73,3,FALSE))","v":""},{"$f":"IF(VLOOKUP(K$3,'Background Calcs'!$A$22:$C$73,3,FALSE)=0,\"\",VLOOKUP(K$3,'Background Calcs'!$A$22:$C$73,3,FALSE))","v":""},{"$f":"IF(VLOOKUP(L$3,'Background Calcs'!$A$22:$C$73,3,FALSE)=0,\"\",VLOOKUP(L$3,'Background Calcs'!$A$22:$C$73,3,FALSE))","v":""},{"$f":"IF(VLOOKUP(M$3,'Background Calcs'!$A$22:$C$73,3,FALSE)=0,\"\",VLOOKUP(M$3,'Background Calcs'!$A$22:$C$73,3,FALSE))","v":""},{"$f":"IF(VLOOKUP(N$3,'Background Calcs'!$A$22:$C$73,3,FALSE)=0,\"\",VLOOKUP(N$3,'Background Calcs'!$A$22:$C$73,3,FALSE))","v":""},{"$f":"IF(VLOOKUP(O$3,'Background Calcs'!$A$22:$C$73,3,FALSE)=0,\"\",VLOOKUP(O$3,'Background Calcs'!$A$22:$C$73,3,FALSE))","v":""}]
[null,"Kitchen Food Waste","Protein",{"$f":"SUMIFS('Stored Data'!$Y:$Y,'Stored Data'!$Z:$Z,'Audit Data Summary'!$C6,'Stored Data'!$AA:$AA,'Audit Data Summary'!D$5,'Stored Data'!$AB:$AB,$B$6)","v":0},{"$f":"SUMIFS('Stored Data'!$Y:$Y,'Stored Data'!$Z:$Z,'Audit Data Summary'!$C6,'Stored Data'!$AA:$AA,'Audit Data Summary'!E$5,'Stored Data'!$AB:$AB,$B$6)","v":0},{"$f":"SUMIFS('Stored Data'!$Y:$Y,'Stored Data'!$Z:$Z,'Audit Data Summary'!$C6,'Stored Data'!$AA:$AA,'Audit Data Summary'!F$5,'Stored Data'!$AB:$AB,$B$6)","v":0},{"$f":"SUMIFS('Stored Data'!$Y:$Y,'Stored Data'!$Z:$Z,'Audit Data Summary'!$C6,'Stored Data'!$AA:$AA,'Audit Data Summary'!G$5,'Stored Data'!$AB:$AB,$B$6)","v":0},{"$f":"SUMIFS('Stored Data'!$Y:$Y,'Stored Data'!$Z:$Z,'Audit Data Summary'!$C6,'Stored Data'!$AA:$AA,'Audit Data Summary'!H$5,'Stored Data'!$AB:$AB,$B$6)","v":0},{"$f":"SUMIFS('Stored Data'!$Y:$Y,'Stored Data'!$Z:$Z,'Audit Data Summary'!$C6,'Stored Data'!$AA:$AA,'Audit Data Summary'!I$5,'Stored Data'!$AB:$AB,$B$6)","v":0},{"$f":"SUMIFS('Stored Data'!$Y:$Y,'Stored Data'!$Z:$Z,'Audit Data Summary'!$C6,'Stored Data'!$AA:$AA,'Audit Data Summary'!J$5,'Stored Data'!$AB:$AB,$B$6)","v":0},{"$f":"SUMIFS('Stored Data'!$Y:$Y,'Stored Data'!$Z:$Z,'Audit Data Summary'!$C6,'Stored Data'!$AA:$AA,'Audit Data Summary'!K$5,'Stored Data'!$AB:$AB,$B$6)","v":0},{"$f":"SUMIFS('Stored Data'!$Y:$Y,'Stored Data'!$Z:$Z,'Audit Data Summary'!$C6,'Stored Data'!$AA:$AA,'Audit Data Summary'!L$5,'Stored Data'!$AB:$AB,$B$6)","v":0},{"$f":"SUMIFS('Stored Data'!$Y:$Y,'Stored Data'!$Z:$Z,'Audit Data Summary'!$C6,'Stored Data'!$AA:$AA,'Audit Data Summary'!M$5,'Stored Data'!$AB:$AB,$B$6)","v":0},{"$f":"SUMIFS('Stored Data'!$Y:$Y,'Stored Data'!$Z:$Z,'Audit Data Summary'!$C6,'Stored Data'!$AA:$AA,'Audit Data Summary'!N$5,'Stored Data'!$AB:$AB,$B$6)","v":0},{"$f":"SUMIFS('Stored Data'!$Y:$Y,'Stored Data'!$Z:$Z,'Audit Data Summary'!$C6,'Stored Data'!$AA:$AA,'Audit Data Summary'!O$5,'Stored Data'!$AB:$AB,$B$6)","v":0}]
{"$rows_left_out":59}
{"sheet":"Stored Data","index":7,"n_rows":3,"n_cols":2,"rows_kept":3,"cut":false,"hidden":false,"merged":[[2,1,2,11]]}
[]
[null,"Stored Data"]
[null,"This sheet contains data originally entered on the Data Entry sheet and saved after clicking the \"Store Data\" button. The stored data on this sheet can be edited below and any edits will be reflected in summary tables and charts. If you wish to clear all stored data on this sheet, click the \"Clear All Stored Data\" button above."]

{"sheet":"Sources","index":8,"n_rows":8,"n_cols":4,"rows_kept":8,"cut":false,"hidden":false,"merged":[[3,1,7,1]]}
[]
[null,"Tab","Source","Website"]
[]
[null,"Conversion Helper","Eco-Dumpster.com","http://www.eco-dumpster.com/rates.html"]
[null,null,"CalRecycle - Conversion Factors: Glass, Plastic, Paper, and Cardboard","http://www.calrecycle.ca.gov/LGCentral/Library/DSG/IRecycl.htm"]
[null,null,"CalRecycle - Conversion Factors: Organics","http://www.calrecycle.ca.gov/LGCentral/Library/DSG/IOrganic.htm"]
{"$rows_left_out":3}
{"sheet":"Background Calcs","index":9,"n_rows":73,"n_cols":14,"rows_kept":73,"cut":false,"hidden":true,"merged":[]}
[]
[]
[null,null,null,null,null,null,null,1,null,null,null,"Number of venues chosen",1]
[1,{"$f":"TODAY()+VLOOKUP(WEEKDAY(TODAY()),$I$6:$J$12,2,FALSE)","v":"2016-12-19"},null,"Date selected",{"$f":"TEXT(VLOOKUP(DateTest,$A$4:$B$13,2,FALSE),\"m/d/yyyy\")","v":"12/19/2016"},null,null,null,null,null,null,null,null,1]
[2,{"$f":"B4-7","v":"2016-12-12"},null,null,null,null,null,null,null,null,null,null,null,2]
[3,"2016-12-05",null,null,null,null,null,null,1,1,null,null,null,3]
{"$rows_left_out":68}
{"sheet":"Conversion Factors","index":10,"n_rows":47,"n_cols":7,"rows_kept":47,"cut":false,"hidden":true,"merged":[[45,1,46,1],[4,1,6,1],[7,1,8,1],[9,1,10,1],[11,1,12,1],[13,1,14,1],[17,1,25,1],[26,1,30,1],[31,1,35,1],[36,1,40,1],[41,1,42,1]]}
[]
[null,"Fixed Conversion Factors"]
[]
[null,"Kitchen Food Waste","Waste Name","Unit","Weight per Unit (lbs)","Number of Units","Weight (lbs)"]
[null,"Protein","meat, ground","cubic foot",52.5,1,{"$f":"E5*F5","v":52.5}]
[]
{"$rows_left_out":41}